Target
Sigma non-opioid intracellular receptor 1
Ligand
BDBM277316
Substrate
Meas. Tech.
Human Sigma1 Receptor Radioligand Assay
pH
8±n/a
Ki
<100±n/a nM
Comments
extracted
Citation
 Almansa-Rosales, C Spiro-isoquinoline-3,4′-piperidine compounds having activity against pain US Patent  US10072008 Publication Date 9/11/2018 
Target
Name:
Sigma non-opioid intracellular receptor 1
Synonyms:
Aging-associated gene 8 protein SGMR1_HUMAN SIGMAR1 SR31747-binding protein Sigma 1-type opioid receptor Sigma1R | hSigmaR1
Type:
Enzyme Catalytic Domain
Mol. Mass.:
25124.85
Organism:
Homo sapiens (Human)
Description:
Q99720
Residue:
223
  
Inhibitor
Name:
BDBM277316
Synonyms:
1'-benzyl-2,4-dihydro-1H-spiro[isoquinoline-3,4'-piperidine] | US10072008, Example 4
Type:
Small organic molecule
Emp. Form.:
C20H24N2
Mol. Mass.:
292.418
SMILES:
C(N1CCC2(CC1)Cc1ccccc1CN2)c1ccccc1
: