Target
Histamine H3 receptor
Ligand
BDBM22541
Substrate
Ki
0.78±n/a nM
Comments
PDSP_539
Citation
 Esbenshade, TAKrueger, KMMiller, TRKang, CHDenny, LIWitte, DGYao, BBFox, GBFaghih, RBennani, YLWilliams, MHancock, AA Two novel and selective nonimidazole histamine H3 receptor antagonists A-304121 and A-317920: I. In vitro pharmacological effects. J Pharmacol Exp Ther 305:887-96 (2003)  
Target
Name:
Histamine H3 receptor
Synonyms:
G-protein coupled receptor 97 HH3R HRH3 Histamine H3 receptor (H3) Histamine receptor (H3 and H4)
Type:
G Protein-Coupled Receptor (GPCR)
Mol. Mass.:
48691.47
Organism:
Homo sapiens (Human)
Description:
Binding assays were using CHO cells stably expressing hH3R receptors.
Residue:
445
  
Inhibitor
Name:
BDBM22541
Synonyms:
Clobenpropit VUF 9153 VUF9153
Type:
Small organic molecule
Emp. Form.:
C14H17ClN4S
Mol. Mass.:
308.83
SMILES:
NC(SCCCc1cnc[nH]1)=NCc1ccc(Cl)cc1
: