Target
Carbonic anhydrase 2
Ligand
BDBM86065
Substrate
Meas. Tech.
Esterase Activity Assay
pH
10±0
IC50
246000±0.0 nM
Citation
 Basaran, ISinan, SCakir, UBulut, MArslan, OOzensoy, O In vitro inhibition of cytosolic carbonic anhydrases I and II by some new dihydroxycoumarin compounds. J Enzyme Inhib Med Chem 23:32-6 (2008)  
Target
Name:
Carbonic anhydrase 2
Synonyms:
CA-II CAC Carbonate dehydratase II Carbonic anhydrase 2 (CA-II) Carbonic anhydrase C Carbonic anhydrase II (CA-II) Carbonic anhydrase II (hCA II) | Carbonic anhydrase isoenzyme II (hCA II)
Type:
Enzyme
Mol. Mass.:
29250.71
Organism:
Homo sapiens (Human)
Description:
P00918
Residue:
260
  
Inhibitor
Name:
BDBM86065
Synonyms:
DCP
Type:
Small organic molecule
Emp. Form.:
C15H10O4
Mol. Mass.:
254.2375
SMILES:
Oc1cc2cc(-c3ccccc3)c(=O)oc2cc1O
: