Target
L-lactate dehydrogenase A chain
Ligand
BDBM86119
Substrate
Meas. Tech.
Nuclear Magnetic Resonance (NMR) Assay
pH
7.5±0
Kd
4.200e+6±n/a nM
Citation
 Ward, RABrassington, CBreeze, ALCaputo, ACritchlow, SDavies, GGoodwin, LHassall, GGreenwood, RHoldgate, GAMrosek, MNorman, RAPearson, STart, JTucker, JAVogtherr, MWhittaker, DWingfield, JWinter, JHudson, K Design and synthesis of novel lactate dehydrogenase a inhibitors by fragment-based lead generation. J Med Chem 55:3285-306 (2012)  
Target
Name:
L-lactate dehydrogenase A chain
Synonyms:
L-lactate dehydrogenase A LDHA_RAT Ldh1 | Ldha
Type:
Protein
Mol. Mass.:
36456.12
Organism:
Rattus norvegicus (Rat)
Description:
P04642::PDB Codes: 4ajl, 4aj2, 4aje, 4aji, 4ajk, 4ajh, 4ajl, 4al4, 4ajh, 4ajo
Residue:
332
  
Inhibitor
Name:
BDBM86119
Synonyms:
LDHA Inhibitor, 14
Type:
Small organic molecule
Emp. Form.:
C7H5ClN4
Mol. Mass.:
180.594
SMILES:
Clc1ccccc1-c1nnn[nH]1
: