Target
L-lactate dehydrogenase A chain
Ligand
BDBM86124
Substrate
Meas. Tech.
Surface Plasmon Resonance (SPR) Assay
pH
7.4±0
Kd
2.10e+5±n/a nM
Citation
 Ward, RABrassington, CBreeze, ALCaputo, ACritchlow, SDavies, GGoodwin, LHassall, GGreenwood, RHoldgate, GAMrosek, MNorman, RAPearson, STart, JTucker, JAVogtherr, MWhittaker, DWingfield, JWinter, JHudson, K Design and synthesis of novel lactate dehydrogenase a inhibitors by fragment-based lead generation. J Med Chem 55:3285-306 (2012)  
Target
Name:
L-lactate dehydrogenase A chain
Synonyms:
L-lactate dehydrogenase A LDHA_RAT Ldh1 | Ldha
Type:
Protein
Mol. Mass.:
36456.12
Organism:
Rattus norvegicus (Rat)
Description:
P04642::PDB Codes: 4ajl, 4aj2, 4aje, 4aji, 4ajk, 4ajh, 4ajl, 4al4, 4ajh, 4ajo
Residue:
332
  
Inhibitor
Name:
BDBM86124
Synonyms:
LDHA Inhibitor, 20
Type:
Small organic molecule
Emp. Form.:
C9H7BrO5
Mol. Mass.:
275.053
SMILES:
OC(=O)C(Oc1ccc(Br)cc1)C(O)=O
: