Target
Orexin/Hypocretin receptor type 1
Ligand
BDBM163961
Substrate
Meas. Tech.
Radioligand Binding Assay
Temperature
277.15±n/a K
Ki
11±n/a nM
Comments
extracted
Citation
 Coate, HRDvorak, CALebold, TPPreville, CShireman, BT Substituted 7-azabicycles and their use as orexin receptor modulators US Patent  US9695183 Publication Date 7/4/2017 
Target
Name:
Orexin/Hypocretin receptor type 1
Synonyms:
HCRTR1 OX1R_HUMAN Orexin receptor type 1 (OR 1) Orexin receptor type 1 (OX1) Orexin receptor type 1 (OxR1) | Ox1r
Type:
Protein
Mol. Mass.:
47554.50
Organism:
Homo sapiens (Human)
Description:
O43613
Residue:
425
  
Inhibitor
Name:
BDBM163961
Synonyms:
US9062078, 92 US9637496, 92 | US9695183, 92
Type:
Small organic molecule
Emp. Form.:
C23H23N3O2S
Mol. Mass.:
405.513
SMILES:
Cc1nc(C(=O)N2C3CCC2C(COc2ccccn2)C3)c(s1)-c1ccccc1
: