Target
Retinol-binding protein 4
Ligand
BDBM249482
Substrate
Meas. Tech.
TR-FRET Assay for Retinol-induced RBP4-TTR Interaction
pH
7.5±n/a
IC50
4.33±n/a nM
Comments
extracted
Citation
 Petrukhin, KCioffi, CJohnson, GAllikmets, RFreeman, EChen, PConlon, MZhu, L Substituted 4-phenylpiperidines, their preparation and use US Patent  US10072016 Publication Date 9/11/2018 
Target
Name:
Retinol-binding protein 4
Synonyms:
PRBP RBP RET4_HUMAN Retinol-binding protein 4 (RBP4) | spa binding assay for rbp4
Type:
Protein
Mol. Mass.:
23008.75
Organism:
Homo sapiens (Human)
Description:
P02753
Residue:
201
  
Inhibitor
Name:
BDBM249482
Synonyms:
US10072016, Compound 81 US10913746, Compound 81 US9434727, 80 US9777010, Compound 81
Type:
Small organic molecule
Emp. Form.:
C21H21F5N4O2
Mol. Mass.:
456.4091
SMILES:
CC(=O)N1CCc2c(C1)[nH]nc2C(=O)N1CCC(CC1)c1ccc(F)c(F)c1C(F)(F)F
: