Target
Retinol-binding protein 4
Ligand
BDBM249564
Substrate
Meas. Tech.
TR-FRET Assay for Retinol-induced RBP4-TTR Interaction
pH
7.5±n/a
IC50
4.82±n/a nM
Comments
extracted
Citation
 Petrukhin, KCioffi, CJohnson, GAllikmets, RFreeman, EChen, PConlon, MZhu, L Substituted 4-phenylpiperidines, their preparation and use US Patent  US10072016 Publication Date 9/11/2018 
Target
Name:
Retinol-binding protein 4
Synonyms:
PRBP RBP RET4_HUMAN Retinol-binding protein 4 (RBP4) | spa binding assay for rbp4
Type:
Protein
Mol. Mass.:
23008.75
Organism:
Homo sapiens (Human)
Description:
P02753
Residue:
201
  
Inhibitor
Name:
BDBM249564
Synonyms:
US10072016, Compound 162 US10913746, Compound 162 US9434727, 162 | US9777010, Compound 162
Type:
Small organic molecule
Emp. Form.:
C20H15ClF3N5O
Mol. Mass.:
433.814
SMILES:
FC(F)(F)c1c(Cl)cccc1C1CCN(CC1)C(=O)c1nnc2ccc(cn12)C#N
: