Target
Pro-FMRFamide-related neuropeptide FF
Ligand
BDBM86140
Substrate
Ki
0.13±n/a nM
Comments
PDSP_2999
Citation
 Engström, MBrandt, AWurster, SSavola, JMPanula, P Prolactin releasing peptide has high affinity and efficacy at neuropeptide FF2 receptors. J Pharmacol Exp Ther 305:825-32 (2003)  
Target
Name:
Pro-FMRFamide-related neuropeptide FF
Synonyms:
FMRFamide-related peptides Npff
Type:
Enzyme Catalytic Domain
Mol. Mass.:
13156.33
Organism:
RAT
Description:
NPFF 0 RAT::Q9WVA9
Residue:
114
  
Inhibitor
Name:
BDBM86140
Synonyms:
CAS_123797 NSC_123797
Type:
Small organic molecule
Emp. Form.:
C54H76N14O10
Mol. Mass.:
1081.269
SMILES:
[#6]-[#6](-[#6])-[#6]-[#6](-[#7]-[#6](=O)-[#6](-[#7])-[#6]-c1ccccc1)-[#6](=O)-[#7]-[#6](-[#6]-c1ccccc1)-[#6](=O)-[#7]-[#6](-[#6]-[#6]-[#6](-[#7])=O)-[#6](=O)-[#7]-1-[#6]-[#6]-[#6]-[#6]-1-[#6](=O)-[#7]-[#6](-[#6]-[#6]-[#6](-[#7])=O)-[#6](=O)-[#7]-[#6](-[#6]-[#6]-[#6]\[#7]=[#6](\[#7])-[#7])-[#6](=O)-[#7]-[#6](-[#6]-c1ccccc1)-[#6](-[#7])=O
: