Target
Ionotropic glutamate receptor subunit Delta2
Ligand
BDBM50038002
Substrate
Ki
>10000±n/a nM
Comments
PDSP_3010
Citation
 Williams, KDattilo, MSabado, TNKashiwagi, KIgarashi, K Pharmacology of delta2 glutamate receptors: effects of pentamidine and protons. J Pharmacol Exp Ther 305:740-8 (2003)  
Target
Name:
Ionotropic glutamate receptor subunit Delta2
Synonyms:
Glutamate delta 2 | Glutamate receptor delta-2 subunit
Type:
Enzyme Catalytic Domain
Mol. Mass.:
19076.25
Organism:
Xenopus
Description:
B9V8R6
Residue:
168
  
Inhibitor
Name:
BDBM50038002
Synonyms:
Benzamidine (Protonated) CHEMBL537204 | benzamidine
Type:
Small organic molecule
Emp. Form.:
C7H8N2
Mol. Mass.:
120.1518
SMILES:
NC(=N)c1ccccc1
: