Target
D(1A) dopamine receptor
Ligand
BDBM86181
Substrate
Ki
180±n/a nM
Comments
PDSP_5005
Citation
 Qandil, AMLewis, MMJassen, ALeonard, SKMailman, RBNichols, DE Synthesis and pharmacological evaluation of substituted naphth[1,2,3-de]isoquinolines (dinapsoline analogues) as D1 and D2 dopamine receptor ligands. Bioorg Med Chem 11:1451-64 (2003)  
Target
Name:
D(1A) dopamine receptor
Synonyms:
DOPAMINE D1 Dopamine D1 high Dopamine receptor Dopamine1-like Drd1a
Type:
Enzyme Catalytic Domain
Mol. Mass.:
49429.75
Organism:
RAT
Description:
P18901
Residue:
446
  
Inhibitor
Name:
BDBM86181
Synonyms:
Dihydrexidine, N-propyl
Type:
Small organic molecule
Emp. Form.:
C20H23NO2
Mol. Mass.:
309.4021
SMILES:
CCCN1Cc2ccccc2[C@@H]2[C@@H]1CCc1cc(O)c(O)cc21
: