Target
Gamma-aminobutyric acid receptor subunit alpha-1
Ligand
BDBM86201
Substrate
Ki
>10000±n/a nM
Comments
PDSP_2976
Citation
 Shi, QSavage, JEHufeisen, SJRauser, LGrajkowska, EErnsberger, PWroblewski, JTNadeau, JHRoth, BL L-homocysteine sulfinic acid and other acidic homocysteine derivatives are potent and selective metabotropic glutamate receptor agonists. J Pharmacol Exp Ther 305:131-42 (2003)  
Target
Name:
Gamma-aminobutyric acid receptor subunit alpha-1
Synonyms:
Benzodiazepine central GABA A Benzodiazepine GABA A Benzodiazepine Type II GABA A Benzodiazepine Type IIM GABA A Benzodiazepine omega2 GABA A alpha1 GABA receptor alpha-1 subunit GABA-PICROTOXIN Gabra-1 TBPS
Type:
Enzyme
Mol. Mass.:
51770.21
Organism:
Rattus norvegicus (Rat)
Description:
P62813
Residue:
455
  
Inhibitor
Name:
BDBM86201
Synonyms:
L-homocysteine sulfinic acid
Type:
Small organic molecule
Emp. Form.:
C4H9NO4S
Mol. Mass.:
167.184
SMILES:
N[C@@H](CCS(O)=O)C(O)=O
: