Target
Metabotropic glutamate receptor 6
Ligand
BDBM86201
Substrate
Ki
6165.95±n/a nM
Comments
PDSP_2976
Citation
 Shi, QSavage, JEHufeisen, SJRauser, LGrajkowska, EErnsberger, PWroblewski, JTNadeau, JHRoth, BL L-homocysteine sulfinic acid and other acidic homocysteine derivatives are potent and selective metabotropic glutamate receptor agonists. J Pharmacol Exp Ther 305:131-42 (2003)  
Target
Name:
Metabotropic glutamate receptor 6
Synonyms:
GRM6_RAT Grm6 Metabotropic glutamate receptor 6 (mGlu6) mGlu6 | metabotropic glutamate 6
Type:
Enzyme
Mol. Mass.:
95095.82
Organism:
Rattus norvegicus (Rat)
Description:
P35349
Residue:
871
  
Inhibitor
Name:
BDBM86201
Synonyms:
L-homocysteine sulfinic acid
Type:
Small organic molecule
Emp. Form.:
C4H9NO4S
Mol. Mass.:
167.184
SMILES:
N[C@@H](CCS(O)=O)C(O)=O
: