Target
Kappa-type opioid receptor
Ligand
BDBM86201
Substrate
Ki
>10000±n/a nM
Comments
PDSP_2976
Citation
 Shi, QSavage, JEHufeisen, SJRauser, LGrajkowska, EErnsberger, PWroblewski, JTNadeau, JHRoth, BL L-homocysteine sulfinic acid and other acidic homocysteine derivatives are potent and selective metabotropic glutamate receptor agonists. J Pharmacol Exp Ther 305:131-42 (2003)  
Target
Name:
Kappa-type opioid receptor
Synonyms:
Kappa Opioid Receptor OPRK1 Opiate Kappa 1 | mu/kappa opioid receptor
Type:
G Protein-Coupled Receptor (GPCR)
Mol. Mass.:
42744.99
Organism:
Cavia porcellus (domestic guinea pig)
Description:
P41144
Residue:
380
  
Inhibitor
Name:
BDBM86201
Synonyms:
L-homocysteine sulfinic acid
Type:
Small organic molecule
Emp. Form.:
C4H9NO4S
Mol. Mass.:
167.184
SMILES:
N[C@@H](CCS(O)=O)C(O)=O
: