Target
Vasopressin V2 receptor
Ligand
BDBM86195
Substrate
Ki
>10000±n/a nM
Comments
PDSP_2969
Citation
 Shi, QSavage, JEHufeisen, SJRauser, LGrajkowska, EErnsberger, PWroblewski, JTNadeau, JHRoth, BL L-homocysteine sulfinic acid and other acidic homocysteine derivatives are potent and selective metabotropic glutamate receptor agonists. J Pharmacol Exp Ther 305:131-42 (2003)  
Target
Name:
Vasopressin V2 receptor
Synonyms:
ADHR AVPR2 DIR Renal-type arginine vasopressin receptor V2R_HUMAN Vasopressin V2 receptor | Vasopressin receptor
Type:
Receptor
Mol. Mass.:
40295.28
Organism:
Homo sapiens (Human)
Description:
P30518
Residue:
371
  
Inhibitor
Name:
BDBM86195
Synonyms:
CAS_6137 D-methionine NSC_6137 | NSC_84815
Type:
Small organic molecule
Emp. Form.:
C5H11NO2S
Mol. Mass.:
149.211
SMILES:
CSCCC(N)C(O)=O
: