Target
Poly [ADP-ribose] polymerase tankyrase-2
Ligand
BDBM185801
Substrate
Meas. Tech.
Biochemical Assay
IC50
23.0±1 nM
Citation
 Chen, CHChin, DNDiPietro, LVFan, JPalermo, MGShultz, MDToure, B 4-piperidinyl compounds for use as tankyrase inhibitors US Patent  USRE46942 Publication Date 7/10/2018 
Target
Name:
Poly [ADP-ribose] polymerase tankyrase-2
Synonyms:
(ARTD6 or PARP5b) Poly [ADP-ribose] polymerase tankyrase-2 TNKL TNKS2_HUMAN Tankyrase 2 Tankyrase-2 Tankyrase-2 (TNKS2)
Type:
Enzyme
Mol. Mass.:
126937.16
Organism:
Homo sapiens (Human)
Description:
Q9H2K2
Residue:
1166
  
Inhibitor
Name:
BDBM185801
Synonyms:
US9163003, 9 | USRE46942, Example 9
Type:
Small organic molecule
Emp. Form.:
C24H27ClN4O4
Mol. Mass.:
470.949
SMILES:
Clc1ccc(cc1)C(=O)C1CCN(CC1)C1CCN(Cc2nc3CCOCc3c(=O)[nH]2)C1=O
: