Target
Poly [ADP-ribose] polymerase 1
Ligand
BDBM185801
Substrate
Meas. Tech.
Biochemical Assay
IC50
16600±4200 nM
Citation
 Chen, CHChin, DNDiPietro, LVFan, JPalermo, MGShultz, MDToure, B 4-piperidinyl compounds for use as tankyrase inhibitors US Patent  USRE46942 Publication Date 7/10/2018 
Target
Name:
Poly [ADP-ribose] polymerase 1
Synonyms:
(ARTD1 or PARP1) 2.4.2.30 ADPRT ARTD1 Human diphtheria toxin-like ADP-ribosyltransferase (ARTD1 or PARP1) NT-PARP-1 PARP1 PPOL Poly [ADP-ribose] polymerase 1 (PARP) Poly [ADP-ribose] polymerase 1 (PARP1) Poly [ADP-ribose] polymerase 1, 28-kDa form Poly [ADP-ribose] polymerase 1, processed C-terminus Poly [ADP-ribose] polymerase-1 Poly(ADP-ribose) polymerase-1 (ARTD1/PARP1) Protein poly-ADP-ribosyltransferase PARP1 | Synonyms=ADPRT
Type:
Mol. Mass.:
113114.22
Organism:
Homo sapiens (Human)
Description:
P09874
Residue:
1014
  
Inhibitor
Name:
BDBM185801
Synonyms:
US9163003, 9 | USRE46942, Example 9
Type:
Small organic molecule
Emp. Form.:
C24H27ClN4O4
Mol. Mass.:
470.949
SMILES:
Clc1ccc(cc1)C(=O)C1CCN(CC1)C1CCN(Cc2nc3CCOCc3c(=O)[nH]2)C1=O
: