Target
Poly [ADP-ribose] polymerase tankyrase-1
Ligand
BDBM185806
Substrate
Meas. Tech.
Biochemical Assay
IC50
711±20 nM
Citation
 Chen, CHChin, DNDiPietro, LVFan, JPalermo, MGShultz, MDToure, B 4-piperidinyl compounds for use as tankyrase inhibitors US Patent  USRE46942 Publication Date 7/10/2018 
Target
Name:
Poly [ADP-ribose] polymerase tankyrase-1
Synonyms:
(ARTD5 or PARP5a) PARPL Poly [ADP-ribose] polymerase tankyrase-1 TINF1 TNKS1 Tankyrase 1 Tankyrase-1 Tankyrase-1 (TNKS1)
Type:
Enzyme
Mol. Mass.:
142058.03
Organism:
Homo sapiens (Human)
Description:
O95271
Residue:
1327
  
Inhibitor
Name:
BDBM185806
Synonyms:
US9163003, 14 | USRE46942, Example 14
Type:
Small organic molecule
Emp. Form.:
C26H32N4O5
Mol. Mass.:
480.5561
SMILES:
COc1ccc(cc1C)C(=O)C1CCN(CC1)[C@@H]1CCN(Cc2nc3CCOCc3c(=O)[nH]2)C1=O
: