Target
Poly [ADP-ribose] polymerase 1
Ligand
BDBM185812
Substrate
Meas. Tech.
Biochemical Assay
IC50
>19000±n/a nM
Citation
 Chen, CHChin, DNDiPietro, LVFan, JPalermo, MGShultz, MDToure, B 4-piperidinyl compounds for use as tankyrase inhibitors US Patent  USRE46942 Publication Date 7/10/2018 
Target
Name:
Poly [ADP-ribose] polymerase 1
Synonyms:
(ARTD1 or PARP1) 2.4.2.30 ADPRT ARTD1 Human diphtheria toxin-like ADP-ribosyltransferase (ARTD1 or PARP1) NT-PARP-1 PARP1 PPOL Poly [ADP-ribose] polymerase 1 (PARP) Poly [ADP-ribose] polymerase 1 (PARP1) Poly [ADP-ribose] polymerase 1, 28-kDa form Poly [ADP-ribose] polymerase 1, processed C-terminus Poly [ADP-ribose] polymerase-1 Poly(ADP-ribose) polymerase-1 (ARTD1/PARP1) Protein poly-ADP-ribosyltransferase PARP1 | Synonyms=ADPRT
Type:
Mol. Mass.:
113114.22
Organism:
Homo sapiens (Human)
Description:
P09874
Residue:
1014
  
Inhibitor
Name:
BDBM185812
Synonyms:
US9163003, 24 | USRE46942, Example 24
Type:
Small organic molecule
Emp. Form.:
C24H30N4O4
Mol. Mass.:
438.5194
SMILES:
CCc1cc(=O)[nH]c(CN2CCC(N3CCC(CC3)C(=O)c3ccc(OC)cc3)C2=O)n1
: