Target
Poly [ADP-ribose] polymerase tankyrase-2
Ligand
BDBM185827
Substrate
Meas. Tech.
Biochemical Assay
IC50
16.0±1 nM
Citation
 Chen, CHChin, DNDiPietro, LVFan, JPalermo, MGShultz, MDToure, B 4-piperidinyl compounds for use as tankyrase inhibitors US Patent  USRE46942 Publication Date 7/10/2018 
Target
Name:
Poly [ADP-ribose] polymerase tankyrase-2
Synonyms:
(ARTD6 or PARP5b) Poly [ADP-ribose] polymerase tankyrase-2 TNKL TNKS2_HUMAN Tankyrase 2 Tankyrase-2 Tankyrase-2 (TNKS2)
Type:
Enzyme
Mol. Mass.:
126937.16
Organism:
Homo sapiens (Human)
Description:
Q9H2K2
Residue:
1166
  
Inhibitor
Name:
BDBM185827
Synonyms:
US9163003, 33 | USRE46942, Example 34
Type:
Small organic molecule
Emp. Form.:
C23H28N6O4S
Mol. Mass.:
484.571
SMILES:
COc1ccc(cc1)C(=O)C1CCN(CC1)[C@H]1CCN(CC(=O)Nc2nnc3SCCn23)C1=O
: