Target
Metabotropic glutamate receptor 1
Ligand
BDBM50030627
Substrate
Ki
>10000±n/a nM
Comments
PDSP_2028
Citation
 Lavreysen, HJanssen, CBischoff, FLanglois, XLeysen, JELesage, AS [3H]R214127: a novel high-affinity radioligand for the mGlu1 receptor reveals a common binding site shared by multiple allosteric antagonists. Mol Pharmacol 63:1082-93 (2003)  
Target
Name:
Metabotropic glutamate receptor 1
Synonyms:
GRM1_RAT Grm1 Metabotropic glutamate receptor Mglur1 metabotropic glutamate 1/5-D metabotropic glutamate receptor 1 isoform alpha precursor
Type:
Enzyme Catalytic Domain
Mol. Mass.:
133240.47
Organism:
RAT
Description:
metabotropic glutamate 1/2 0 RAT::P23385
Residue:
1199
  
Inhibitor
Name:
BDBM50030627
Synonyms:
(+-)-MCPG 4-(1-Amino-1-carboxy-ethyl)-benzoic acid CHEMBL299683 | MCPG
Type:
Small organic molecule
Emp. Form.:
C10H11NO4
Mol. Mass.:
209.1986
SMILES:
CC(N)(C(O)=O)c1ccc(cc1)C(O)=O
: