Target
Homeobox C9
Ligand
BDBM86214
Substrate
Ki
9400±n/a nM
Comments
PDSP_3207
Citation
 Lu, XBidaud, ILadram, AGershengorn, MC Pharmacological studies of thyrotropin-releasing hormone (TRH) receptors from Xenopus laevis: is xTRHR3 a TRH receptor? Endocrinology 144:1842-6 (2003)  
Target
Name:
Homeobox C9
Synonyms:
thyrotropin-releasing hormone R3
Type:
Enzyme Catalytic Domain
Mol. Mass.:
45359.82
Organism:
Xenopus
Description:
thyrotropin-releasing hormone R3 0 Xenopus::F7C4A2
Residue:
404
  
Inhibitor
Name:
BDBM86214
Synonyms:
CAS_32281 Phe2TRH | TRH
Type:
Small organic molecule
Emp. Form.:
C16H22N6O4
Mol. Mass.:
362.3837
SMILES:
NC(=O)C1CCCN1C(=O)C(Cc1cnc[nH]1)NC(=O)C1CCC(=O)N1
: