Target
Alpha-1A adrenergic receptor
Ligand
BDBM50133817
Substrate
Ki
>10000±n/a nM
Comments
PDSP_7569
Citation
 Valenzano, KJGrant, ERWu, GHachicha, MSchmid, LTafesse, LSun, QRotshteyn, YFrancis, JLimberis, JMalik, SWhittemore, ERHodges, D N-(4-tertiarybutylphenyl)-4-(3-chloropyridin-2-yl)tetrahydropyrazine -1(2H)-carbox-amide (BCTC), a novel, orally effective vanilloid receptor 1 antagonist with analgesic properties: I. in vitro characterization and pharmacokinetic properties. J Pharmacol Exp Ther 306:377-86 (2003)  
Target
Name:
Alpha-1A adrenergic receptor
Synonyms:
ADA1A_RAT Adra1c Alpha-1A adrenoceptor Alpha-1C adrenergic receptor | adrenergic Alpha1A
Type:
Protein
Mol. Mass.:
51620.15
Organism:
Rattus norvegicus (Rat)
Description:
P43140
Residue:
466
  
Inhibitor
Name:
BDBM50133817
Synonyms:
4-(3-Chloro-pyridin-2-yl)-piperazine-1-carboxylic acid (4-tert-butyl-phenyl)-amide CHEMBL441472 | N-(4-tert-butylphenyl)-4-(3-chloropyridin-2-yl)piperazine-1-carboxamide
Type:
Small organic molecule
Emp. Form.:
C20H25ClN4O
Mol. Mass.:
372.892
SMILES:
CC(C)(C)c1ccc(NC(=O)N2CCN(CC2)c2ncccc2Cl)cc1
: