Target
Tyrosine-protein kinase JAK2
Ligand
BDBM277321
Substrate
IC50
3.40±n/a nM
Citation
 Scott, MEGuerin, DMolinari, DKattar, SFuller, PDinsmore, CKong, NBai, YFu, JLiu, YZheng, Z Ethyl N-boc piperidinyl pyrazolo pyridones as Janus kinase inhibitors US Patent  US10072025 Publication Date 9/11/2018 
Target
Name:
Tyrosine-protein kinase JAK2
Synonyms:
JAK-2 JAK2_HUMAN Janus kinase 2 (JAK2) | Janus kinase 2 (a protein tyrosine kinase)
Type:
Protein
Mol. Mass.:
130684.68
Organism:
Homo sapiens (Human)
Description:
O60674
Residue:
1132
  
Inhibitor
Name:
BDBM277321
Synonyms:
2-tert-butyl-5-[[1-(1-tert- butyl-6-ethyl-2-oxo-1,3- oxazocan-6-yl)-4-oxo- 1H,4H,5H-pyrazolo[4,3- c]pyridin-3-yl]amino]-2,3- dihydro-1,2-benzothiazole- 1,1-dione | US10072025, Example 1-2
Type:
Small organic molecule
Emp. Form.:
C29H40N6O5S
Mol. Mass.:
584.73
SMILES:
CCC1(CCN(CC1)C(=O)OC(C)(C)C)n1nc(Nc2ccc3c(CN(C(C)(C)C)S3(=O)=O)c2)c2c1cc[nH]c2=O
: