Target
Tyrosine-protein kinase JAK2
Ligand
BDBM277342
Substrate
IC50
0.840±n/a nM
Citation
 Scott, MEGuerin, DMolinari, DKattar, SFuller, PDinsmore, CKong, NBai, YFu, JLiu, YZheng, Z Ethyl N-boc piperidinyl pyrazolo pyridones as Janus kinase inhibitors US Patent  US10072025 Publication Date 9/11/2018 
Target
Name:
Tyrosine-protein kinase JAK2
Synonyms:
JAK-2 JAK2_HUMAN Janus kinase 2 (JAK2) | Janus kinase 2 (a protein tyrosine kinase)
Type:
Protein
Mol. Mass.:
130684.68
Organism:
Homo sapiens (Human)
Description:
O60674
Residue:
1132
  
Inhibitor
Name:
BDBM277342
Synonyms:
US10072025, Example 2-20 | tert-butyl 4-(3-(4-((3R,5R or 3S,5S)-3,5- dimethylmorpholine-4- carbonyl)-3- methylphenylamino)-4- oxo-4,5- dihydropyrazolo[4,3- c]pyridin-1-yl)-4- ethylpiperidine-1- carboxylate
Type:
Small organic molecule
Emp. Form.:
C32H44N6O5
Mol. Mass.:
592.729
SMILES:
CCC1(CCN(CC1)C(=O)OC(C)(C)C)n1nc(Nc2ccc(C(=O)N3[C@H](C)COC[C@H]3C)c(C)c2)c2c1cc[nH]c2=O
: