Target
Tyrosine-protein kinase JAK2
Ligand
BDBM277363
Substrate
IC50
6.87±n/a nM
Citation
 Scott, MEGuerin, DMolinari, DKattar, SFuller, PDinsmore, CKong, NBai, YFu, JLiu, YZheng, Z Ethyl N-boc piperidinyl pyrazolo pyridones as Janus kinase inhibitors US Patent  US10072025 Publication Date 9/11/2018 
Target
Name:
Tyrosine-protein kinase JAK2
Synonyms:
JAK-2 JAK2_HUMAN Janus kinase 2 (JAK2) | Janus kinase 2 (a protein tyrosine kinase)
Type:
Protein
Mol. Mass.:
130684.68
Organism:
Homo sapiens (Human)
Description:
O60674
Residue:
1132
  
Inhibitor
Name:
BDBM277363
Synonyms:
US10072025, Example 2-41 | tert-butyl 4-ethyl-4-(4- oxo-3-((4-(2,2,2-trifluoro- 1-methoxyethyl)phenyl) amino)-4,5-dihydro-1H- pyrazolo[4,3-c]pyridin-1- yl)piperidine-1- carboxylate (derived from I-6A)
Type:
Small organic molecule
Emp. Form.:
C28H36F3N5O4
Mol. Mass.:
563.6117
SMILES:
CCC1(CCN(CC1)C(=O)OC(C)(C)C)n1nc(Nc2ccc(cc2)C(C)(OC)C(F)(F)F)c2c1cc[nH]c2=O
: