Target
Tyrosine-protein kinase JAK1
Ligand
BDBM277369
Substrate
Meas. Tech.
Jak Biochemical HTRF Assay Protocol
Temperature
298.15±n/a K
IC50
0.990±n/a nM
Comments
extracted
Citation
 Scott, MEGuerin, DMolinari, DKattar, SFuller, PDinsmore, CKong, NBai, YFu, JLiu, YZheng, Z Ethyl N-boc piperidinyl pyrazolo pyridones as Janus kinase inhibitors US Patent  US10072025 Publication Date 9/11/2018 
Target
Name:
Tyrosine-protein kinase JAK1
Synonyms:
JAK-1 JAK1A JAK1_HUMAN Janus kinase 1 (JAK1) | Janus kinase 1 JAK1
Type:
Protein
Mol. Mass.:
133293.73
Organism:
Homo sapiens (Human)
Description:
P23458
Residue:
1154
  
Inhibitor
Name:
BDBM277369
Synonyms:
US10072025, Example 3-3 | tert-butyl 4-ethyl-4-(3-{[3- methyl-4-(6-oxa-9- azaspiro[4.5] dec-9- ylcarbonyl) phenyl]amino}-4-oxo-4,5- dihydro-1H-pyrazolo[4,3- c]pyridin-1-yl) piperidine- 1-carboxylate
Type:
Small organic molecule
Emp. Form.:
C34H46N6O5
Mol. Mass.:
618.7662
SMILES:
CCC1(CCN(CC1)C(=O)OC(C)(C)C)n1nc(Nc2ccc(C(=O)N3CCOC4(CCCC4)C3)c(C)c2)c2c1cc[nH]c2=O
: