Target
Tyrosine-protein kinase JAK1
Ligand
BDBM277373
Substrate
Meas. Tech.
Jak Biochemical HTRF Assay Protocol
Temperature
298.15±n/a K
IC50
0.520±n/a nM
Comments
extracted
Citation
 Scott, MEGuerin, DMolinari, DKattar, SFuller, PDinsmore, CKong, NBai, YFu, JLiu, YZheng, Z Ethyl N-boc piperidinyl pyrazolo pyridones as Janus kinase inhibitors US Patent  US10072025 Publication Date 9/11/2018 
Target
Name:
Tyrosine-protein kinase JAK1
Synonyms:
JAK-1 JAK1A JAK1_HUMAN Janus kinase 1 (JAK1) | Janus kinase 1 JAK1
Type:
Protein
Mol. Mass.:
133293.73
Organism:
Homo sapiens (Human)
Description:
P23458
Residue:
1154
  
Inhibitor
Name:
BDBM277373
Synonyms:
US10072025, Example 3-7 | tert-butyl 4-{3-[(4- {[(2S,6S)-2,6- dimethylmorpholin-4- yl]carbonyl}-3- methylphenyl)amino]-4- oxo-4,5-dihydro-1H- pyrazolo[4,3-c] pyridin-1- yl}-4-ethylpiperidine-1- carboxylate
Type:
Small organic molecule
Emp. Form.:
C32H44N6O5
Mol. Mass.:
592.729
SMILES:
CCC1(CCN(CC1)C(=O)OC(C)(C)C)n1nc(Nc2ccc(C(=O)N3C[C@H](C)O[C@@H](C)C3)c(C)c2)c2c1cc[nH]c2=O
: