Target
Acetylcholine receptor subunit alpha
Ligand
BDBM50010588
Substrate
Ki
>10000±n/a nM
Comments
PDSP_1184
Citation
 Setola, VHufeisen, SJGrande-Allen, KJVesely, IGlennon, RABlough, BRothman, RBRoth, BL 3,4-methylenedioxymethamphetamine (MDMA, "Ecstasy") induces fenfluramine-like proliferative actions on human cardiac valvular interstitial cells in vitro. Mol Pharmacol 63:1223-9 (2003)  
Target
Name:
Acetylcholine receptor subunit alpha
Synonyms:
ACHA_HUMAN Acetylcholine receptor protein alpha chain CHNRA Cholinergic, Nicotinic Alpha1Beta1DeltaGamma Nicotinic acetylcholine receptor alpha-1/beta-1 Nicotinic acetylcholine receptor alpha2/beta4 n-AChR
Type:
Ion channel
Mol. Mass.:
54542.01
Organism:
Homo sapiens (Human)
Description:
Residue:
482
  
Inhibitor
Name:
BDBM50010588
Synonyms:
(RS)-3,4-(methylenedioxy)methamphetamine 1-(1,3-benzodioxol-5-yl)-N-methylpropan-2-amine CHEMBL43048 MDMA N-Methyl-3,4-methylenedioxyamphetamine | US11767305, Compound MDMA
Type:
Small organic molecule
Emp. Form.:
C11H15NO2
Mol. Mass.:
193.2423
SMILES:
CNC(C)Cc1ccc2OCOc2c1
: