Target
Kappa-type opioid receptor
Ligand
BDBM50045114
Substrate
Ki
2.12±n/a nM
Comments
PDSP_776
Citation
 Neal, CROwens, CETaylor, LPHoversten, MTAkil, HWatson, SJ Binding and GTPgammaS autoradiographic analysis of preproorphanin precursor peptide products at the ORL1 and opioid receptors. J Chem Neuroanat 25:233-47 (2003)  
Target
Name:
Kappa-type opioid receptor
Synonyms:
KOR-1 OPIATE Kappa Opioid receptor Ror-d
Type:
G Protein-Coupled Receptor (GPCR)
Mol. Mass.:
42692.90
Organism:
Rattus norvegicus (rat)
Description:
P34975
Residue:
380
  
Inhibitor
Name:
BDBM50045114
Synonyms:
3-Cyclopropylmethyl-6-ethyl-8-hydroxy-11-methyl-3,4,5,6-tetrahydro-2H-2,6-methano-benzo[d]azocin-1-one EKC
Type:
Small organic molecule
Emp. Form.:
C19H25NO2
Mol. Mass.:
299.4073
SMILES:
CCC12CCN(CC3CC3)C(C1C)C(=O)c1ccc(O)cc21
: