Target
Oxysterols receptor LXR-alpha
Ligand
BDBM20176
Substrate
Ki
250±n/a nM
Comments
PDSP_6977
Citation
 Bramlett, KSHouck, KABorchert, KMDowless, MSKulanthaivel, PZhang, YBeyer, TPSchmidt, RThomas, JSMichael, LFBarr, RMontrose, CEacho, PICao, GBurris, TP A natural product ligand of the oxysterol receptor, liver X receptor. J Pharmacol Exp Ther 307:291-6 (2003)  
Target
Name:
Oxysterols receptor LXR-alpha
Synonyms:
LXRA Liver X receptor alpha Liver X receptor alpha (NR1H3) NR1H3 Nuclear orphan receptor LXR-alpha | Nuclear receptor subfamily 1 group H member 3
Type:
Enzyme Catalytic Domain
Mol. Mass.:
50403.85
Organism:
Homo sapiens (Human)
Description:
Q13133
Residue:
447
  
Inhibitor
Name:
BDBM20176
Synonyms:
(1S,2R,5S,10S,11S,14R,15S)-14-[(2S,3S)-3-hydroxy-6-methylheptan-2-yl]-2,15-dimethyltetracyclo[8.7.0.0^{2,7}.0^{11,15}]heptadec-7-en-5-ol 22(S)-hydroxycholesterol
Type:
Steroid
Emp. Form.:
C27H46O2
Mol. Mass.:
402.6529
SMILES:
[H][C@](O)(CCC(C)C)[C@@H](C)[C@@]1([H])CC[C@@]2([H])[C@]3([H])CC=C4C[C@@]([H])(O)CC[C@]4(C)[C@@]3([H])CC[C@]12C
: