Target
D(1A) dopamine receptor
Ligand
BDBM86267
Substrate
Ki
1.1±n/a nM
Comments
PDSP_4925
Citation
 Neumeyer, JLKula, NSBergman, JBaldessarini, RJ Receptor affinities of dopamine D1 receptor-selective novel phenylbenzazepines. Eur J Pharmacol 474:137-40 (2003)  
Target
Name:
D(1A) dopamine receptor
Synonyms:
DOPAMINE D1 Dopamine D1 high Dopamine receptor Dopamine1-like Drd1a
Type:
Enzyme Catalytic Domain
Mol. Mass.:
49429.75
Organism:
RAT
Description:
P18901
Residue:
446
  
Inhibitor
Name:
BDBM86267
Synonyms:
MCL-214
Type:
Small organic molecule
Emp. Form.:
C18H20BrNO2
Mol. Mass.:
362.261
SMILES:
CN1CCc2c(Br)c(O)c(O)cc2C(C1)c1ccccc1C
: