Target
Alpha-2C adrenergic receptor
Ligand
BDBM86285
Substrate
Ki
605±n/a nM
Comments
PDSP_3151
Citation
 Rothman, RBVu, NPartilla, JSRoth, BLHufeisen, SJCompton-Toth, BABirkes, JYoung, RGlennon, RA In vitro characterization of ephedrine-related stereoisomers at biogenic amine transporters and the receptorome reveals selective actions as norepinephrine transporter substrates. J Pharmacol Exp Ther 307:138-45 (2003)  
Target
Name:
Alpha-2C adrenergic receptor
Synonyms:
ADA2C_HUMAN ADRA2L2 Adrenergic alpha2C Adrenergic receptor alpha Alpha-2 adrenergic receptor subtype C4 Alpha-2C adrenoreceptor | adrenergic, alpha-2C-, receptor [Homo sapiens]
Type:
Enzyme
Mol. Mass.:
49552.32
Organism:
Homo sapiens (Human)
Description:
P18825
Residue:
462
  
Inhibitor
Name:
BDBM86285
Synonyms:
CAS_1576 NSC_1576
Type:
Small organic molecule
Emp. Form.:
C10H13NO
Mol. Mass.:
163.2163
SMILES:
CNC(C)C(=O)c1ccccc1
: