Target
Sodium-dependent dopamine transporter
Ligand
BDBM86286
Substrate
Ki
18.5±n/a nM
Comments
PDSP_3150
Citation
 Rothman, RBVu, NPartilla, JSRoth, BLHufeisen, SJCompton-Toth, BABirkes, JYoung, RGlennon, RA In vitro characterization of ephedrine-related stereoisomers at biogenic amine transporters and the receptorome reveals selective actions as norepinephrine transporter substrates. J Pharmacol Exp Ther 307:138-45 (2003)  
Target
Name:
Sodium-dependent dopamine transporter
Synonyms:
DA transporter DAT1 Dopamine transporter protein (DAT) SC6A3_HUMAN Sodium-dependent dopamine transporter Solute carrier family 6 member 3
Type:
Multi-pass membrane protein
Mol. Mass.:
68497.11
Organism:
Homo sapiens (Human)
Description:
Q01959
Residue:
620
  
Inhibitor
Name:
BDBM86286
Synonyms:
CAS_62258 NSC_62258
Type:
Small organic molecule
Emp. Form.:
C9H11NO
Mol. Mass.:
149.1897
SMILES:
CC(N)C(=O)c1ccccc1
: