Target
Sodium-dependent dopamine transporter
Ligand
BDBM50022722
Substrate
Ki
1371±n/a nM
Comments
PDSP_3149
Citation
 Rothman, RBVu, NPartilla, JSRoth, BLHufeisen, SJCompton-Toth, BABirkes, JYoung, RGlennon, RA In vitro characterization of ephedrine-related stereoisomers at biogenic amine transporters and the receptorome reveals selective actions as norepinephrine transporter substrates. J Pharmacol Exp Ther 307:138-45 (2003)  
Target
Name:
Sodium-dependent dopamine transporter
Synonyms:
DA transporter DAT1 Dopamine transporter protein (DAT) SC6A3_HUMAN Sodium-dependent dopamine transporter Solute carrier family 6 member 3
Type:
Multi-pass membrane protein
Mol. Mass.:
68497.11
Organism:
Homo sapiens (Human)
Description:
Q01959
Residue:
620
  
Inhibitor
Name:
BDBM50022722
Synonyms:
(+)2-Amino-1-phenyl-propan-1-ol (1R, 2S)-2-Amino-1-phenyl-propan-1-ol (1S, 2S)-2-Amino-1-phenyl-propan-1-ol Biphetap Bromatapp Codamine Demazin Dimetapp Hycomine Norephedrine, (-) PHENYLPROPANOLAMINE Pseudonorephedrine, (-) [cathine, (-)] Triaminic-12
Type:
Small organic molecule
Emp. Form.:
C9H13NO
Mol. Mass.:
151.2056
SMILES:
CC(N)C(O)c1ccccc1
: