Target
Tyrosine-protein kinase JAK2
Ligand
BDBM277529
Substrate
Meas. Tech.
Biochemical JAK Assay
pH
7.5±n/a
Ki
<0.1±n/a nM
Comments
extracted
Citation
 Huang, XThalladi, VR Crystalline form of 3-((1R,3s,5S)-3-((7-((5-methyl-1H-pyrazol-3-yl)amino)-1,6-naphthyridin-5-yl)amino)-8-azabicyclo[3.2.1]octan-8-yl)propanenitrile US Patent  US10072026 Publication Date 9/11/2018 
Target
Name:
Tyrosine-protein kinase JAK2
Synonyms:
JAK-2 JAK2_HUMAN Janus kinase 2 (JAK2) | Janus kinase 2 (a protein tyrosine kinase)
Type:
Protein
Mol. Mass.:
130684.68
Organism:
Homo sapiens (Human)
Description:
O60674
Residue:
1132
  
Inhibitor
Name:
BDBM277529
Synonyms:
US10072026, Example 4-20 US11780852, Example 4-20
Type:
Small organic molecule
Emp. Form.:
C25H33N7O2S
Mol. Mass.:
495.64
SMILES:
CCC1(CC1)S(=O)(=O)N1[C@H]2CCC[C@@H]1C[C@H](C2)Nc1nc(Nc2cc(C)[nH]n2)cc2ncccc12
: