Target
Muscarinic acetylcholine receptor M1
Ligand
BDBM86291
Substrate
Ki
1096.48±n/a nM
Comments
PDSP_3135
Citation
 De Amici, MConti, PFasoli, EBarocelli, EBallabeni, VBertoni, SImpicciatore, MRoth, BLErnsberger, PDe Micheli, C Synthesis and in vitro pharmacology of novel heterocyclic muscarinic ligands. Farmaco 58:739-48 (2003)  
Target
Name:
Muscarinic acetylcholine receptor M1
Synonyms:
ACM1_HUMAN Cholinergic receptor, muscarinic 1 | Cholinergic, muscarinic M1
Type:
Protein
Mol. Mass.:
51442.54
Organism:
Homo sapiens (Human)
Description:
P11229
Residue:
460
  
Inhibitor
Name:
BDBM86291
Synonyms:
3-[4-(2-Methyl-1H-imidazol-1-yl)-2-butynyl]oxyisoxazole sesquifumarate
Type:
Small organic molecule
Emp. Form.:
C11H11N3O2
Mol. Mass.:
217.2239
SMILES:
Cc1nccn1CC#CCOc1ccon1
: