Target
Muscarinic acetylcholine receptor M4
Ligand
BDBM86291
Substrate
Ki
467.74±n/a nM
Comments
PDSP_3135
Citation
 De Amici, MConti, PFasoli, EBarocelli, EBallabeni, VBertoni, SImpicciatore, MRoth, BLErnsberger, PDe Micheli, C Synthesis and in vitro pharmacology of novel heterocyclic muscarinic ligands. Farmaco 58:739-48 (2003)  
Target
Name:
Muscarinic acetylcholine receptor M4
Synonyms:
ACM4_HUMAN Cholinergic, muscarinic M4 Muscarinic acetylcholine receptor M2 and M4
Type:
Enzyme Catalytic Domain
Mol. Mass.:
53079.31
Organism:
Homo sapiens (Human)
Description:
Cholinergic, muscarinic M4 CHRM4 HUMAN M3::P08173
Residue:
479
  
Inhibitor
Name:
BDBM86291
Synonyms:
3-[4-(2-Methyl-1H-imidazol-1-yl)-2-butynyl]oxyisoxazole sesquifumarate
Type:
Small organic molecule
Emp. Form.:
C11H11N3O2
Mol. Mass.:
217.2239
SMILES:
Cc1nccn1CC#CCOc1ccon1
: