Target
Muscarinic acetylcholine receptor M5
Ligand
BDBM86295
Substrate
Ki
131.83±n/a nM
Comments
PDSP_3132
Citation
 De Amici, MConti, PFasoli, EBarocelli, EBallabeni, VBertoni, SImpicciatore, MRoth, BLErnsberger, PDe Micheli, C Synthesis and in vitro pharmacology of novel heterocyclic muscarinic ligands. Farmaco 58:739-48 (2003)  
Target
Name:
Muscarinic acetylcholine receptor M5
Synonyms:
ACM5_HUMAN | CHRM5
Type:
PROTEIN
Mol. Mass.:
60102.35
Organism:
Homo sapiens (Human)
Description:
ChEMBL_1517990
Residue:
532
  
Inhibitor
Name:
BDBM86295
Synonyms:
2-[4-(2,3-Dimethyl-1H-imidazolium-1-yl)-2-butynyl]isoxazolidin-3-one iodide
Type:
Small organic molecule
Emp. Form.:
C12H16N3O2
Mol. Mass.:
234.2738
SMILES:
Cc1n(CC#CCN2OCCC2=O)cc[n+]1C
: