Target
Protein disulfide-isomerase
Ligand
BDBM86376
Substrate
Meas. Tech.
Reductase Activity Assay
pH
7±0
IC50
958±n/a nM
Citation
 Khan, MMSimizu, SLai, NSKawatani, MShimizu, TOsada, H Discovery of a small molecule PDI inhibitor that inhibits reduction of HIV-1 envelope glycoprotein gp120. ACS Chem Biol 6:245-51 (2011)  
Target
Name:
Protein disulfide-isomerase
Synonyms:
Cellular thyroid hormone-binding protein P4HB PDIA1 PO4DB | Protein Disulfide-Isomerase (PDI)
Type:
Protein
Mol. Mass.:
57084.91
Organism:
Homo sapiens (Human)
Description:
P07237
Residue:
508
  
Inhibitor
Name:
BDBM86376
Synonyms:
Juniferdin derivative, 7
Type:
Small organic molecule
Emp. Form.:
C22H29FO3
Mol. Mass.:
360.4623
SMILES:
C\C1=C/CC(OC(=O)c2ccc(F)cc2)\C(C)=C\[C@@H](O)C(C)(C)CCC1
: