Target
Protein disulfide-isomerase
Ligand
BDBM86378
Substrate
Meas. Tech.
Reductase Activity Assay
pH
7±0
IC50
2.85e+3±n/a nM
Citation
 Khan, MMSimizu, SLai, NSKawatani, MShimizu, TOsada, H Discovery of a small molecule PDI inhibitor that inhibits reduction of HIV-1 envelope glycoprotein gp120. ACS Chem Biol 6:245-51 (2011)  
Target
Name:
Protein disulfide-isomerase
Synonyms:
Cellular thyroid hormone-binding protein P4HB PDIA1 PO4DB | Protein Disulfide-Isomerase (PDI)
Type:
Protein
Mol. Mass.:
57084.91
Organism:
Homo sapiens (Human)
Description:
P07237
Residue:
508
  
Inhibitor
Name:
BDBM86378
Synonyms:
Juniferdin derivative, 9
Type:
Small organic molecule
Emp. Form.:
C15H20O3
Mol. Mass.:
248.3175
SMILES:
Oc1ccc(cc1)C(=O)OC1CCCCCCC1
: