Target
Ubiquitin carboxyl-terminal hydrolase 30
Ligand
BDBM404384
Substrate
Meas. Tech.
Biochemical Fluorescence Intensity Assay
IC50
<100±n/a nM
Citation
 Jones, AKemp, MStockley, MGibson, KWhitlock, G 1-cyano-pyrrolidine compounds as USP30 inhibitors US Patent  US10343992 Publication Date 7/9/2019 
Target
Name:
Ubiquitin carboxyl-terminal hydrolase 30
Synonyms:
Deubiquitinating enzyme 30 USP30 Ubiquitin carboxyl-terminal hydrolase 30 (USP30) Ubiquitin-specific-processing protease 30
Type:
Protein
Mol. Mass.:
58522.90
Organism:
Homo sapiens (Human)
Description:
Q70CQ3
Residue:
517
  
Inhibitor
Name:
BDBM404384
Synonyms:
(R)-2-(2-chlorophenyl)-N-(1- cyanopyrrolidin-3-yl)thiazole-5- carboxamide US10689345, Example 37 US11390584, Example 37
Type:
Small organic molecule
Emp. Form.:
C15H13ClN4OS
Mol. Mass.:
332.808
SMILES:
Clc1ccccc1-c1ncc(s1)C(=O)N[C@@H]1CCN(C1)C#N
: