Target
Ubiquitin carboxyl-terminal hydrolase 30
Ligand
BDBM404590
Substrate
Meas. Tech.
Biochemical Fluorescence Intensity Assay
IC50
<100±n/a nM
Citation
 Jones, AKemp, MStockley, MGibson, KWhitlock, G 1-cyano-pyrrolidine compounds as USP30 inhibitors US Patent  US10343992 Publication Date 7/9/2019 
Target
Name:
Ubiquitin carboxyl-terminal hydrolase 30
Synonyms:
Deubiquitinating enzyme 30 USP30 Ubiquitin carboxyl-terminal hydrolase 30 (USP30) Ubiquitin-specific-processing protease 30
Type:
Protein
Mol. Mass.:
58522.90
Organism:
Homo sapiens (Human)
Description:
Q70CQ3
Residue:
517
  
Inhibitor
Name:
BDBM404590
Synonyms:
(3aR,6aR)-5- cyano-N-(4-(2- methylpyridin-4- yl)phenyl)hexa- hydropyrrolo[3,4- b]pyrrole-1(2H)- carboxamide US10689345, Example 242 US11390584, Example 242
Type:
Small organic molecule
Emp. Form.:
C20H21N5O
Mol. Mass.:
347.4136
SMILES:
Cc1cc(ccn1)-c1ccc(NC(=O)N2CC[C@@H]3CN(C[C@H]23)C#N)cc1
: