Target
Ubiquitin carboxyl-terminal hydrolase 30
Ligand
BDBM404620
Substrate
Meas. Tech.
Biochemical Fluorescence Intensity Assay
IC50
<100±n/a nM
Citation
 Jones, AKemp, MStockley, MGibson, KWhitlock, G 1-cyano-pyrrolidine compounds as USP30 inhibitors US Patent  US10343992 Publication Date 7/9/2019 
Target
Name:
Ubiquitin carboxyl-terminal hydrolase 30
Synonyms:
Deubiquitinating enzyme 30 USP30 Ubiquitin carboxyl-terminal hydrolase 30 (USP30) Ubiquitin-specific-processing protease 30
Type:
Protein
Mol. Mass.:
58522.90
Organism:
Homo sapiens (Human)
Description:
Q70CQ3
Residue:
517
  
Inhibitor
Name:
BDBM404620
Synonyms:
(R)-N-(1- cyanopyrrolidin- 3-yl)-3-(2,4- difluorophenyl) isoxazole-5- carboxamide US11066365, Example 272
Type:
Small organic molecule
Emp. Form.:
C15H12F2N4O2
Mol. Mass.:
318.2782
SMILES:
Fc1ccc(-c2cc(on2)C(=O)N[C@@H]2CCN(C2)C#N)c(F)c1
: