Target
Muscarinic acetylcholine receptor M3
Ligand
BDBM86231
Substrate
Ki
0.1±n/a nM
Comments
PDSP_334
Citation
 Bymaster, FPFelder, CCTzavara, ENomikos, GGCalligaro, DOMckinzie, DL Muscarinic mechanisms of antipsychotic atypicality. Prog Neuropsychopharmacol Biol Psychiatry 27:1125-43 (2003)  
Target
Name:
Muscarinic acetylcholine receptor M3
Synonyms:
ACM3_HUMAN Cholinergic, muscarinic M3 Muscarinic receptor M3 | RecName: Full=Muscarinic acetylcholine receptor M3
Type:
Enzyme
Mol. Mass.:
66151.03
Organism:
Homo sapiens (Human)
Description:
P20309
Residue:
590
  
Inhibitor
Name:
BDBM86231
Synonyms:
ATR Atropine,(-) CHEMBL195 US9333195, ATROPINE
Type:
Small organic molecule
Emp. Form.:
C17H23NO3
Mol. Mass.:
289.3694
SMILES:
CN1C2CCC1CC(C2)OC(=O)C(CO)c1ccccc1
: