Target
Neuronal acetylcholine receptor subunit alpha-4
Ligand
BDBM86311
Substrate
Ki
0.24±n/a nM
Comments
PDSP_608
Citation
 Eaton, JBPeng, JHSchroeder, KMGeorge, AAFryer, JDKrishnan, CBuhlman, LKuo, YPSteinlein, OLukas, RJ Characterization of human alpha 4 beta 2-nicotinic acetylcholine receptors stably and heterologously expressed in native nicotinic receptor-null SH-EP1 human epithelial cells. Mol Pharmacol 64:1283-94 (2003)  
Target
Name:
Neuronal acetylcholine receptor subunit alpha-4
Synonyms:
ACHA4_HUMAN CHRNA4 protein Neuronal acetylcholine receptor protein alpha-4 subunit Nicotinic acetylcholine receptor alpha4/beta2/alpha5
Type:
Mol. Mass.:
69963.49
Organism:
Homo sapiens (Human)
Description:
NACHRA4
Residue:
627
  
Inhibitor
Name:
BDBM86311
Synonyms:
CAS_485-35-8 Cytisine-(-) US11667638, Example Cytisine
Type:
Small organic molecule
Emp. Form.:
C11H14N2O
Mol. Mass.:
190.2417
SMILES:
O=c1cccc2C3CNCC(C3)Cn12
: