Target
Polycystin-1
Ligand
BDBM86432
Substrate
Ki
0.45±n/a nM
Comments
PDSP_3229
Citation
 Wang, QJFang, TWYang, DLewin, NEVan Lint, JMarquez, VEBlumberg, PM Ligand structure-activity requirements and phospholipid dependence for the binding of phorbol esters to protein kinase D. Mol Pharmacol 64:1342-8 (2003)  
Target
Name:
Polycystin-1
Synonyms:
PKD1 Protein Kinase D-GST
Type:
Enzyme Catalytic Domain
Mol. Mass.:
462537.85
Organism:
Homo sapiens (Human)
Description:
Protein Kinase D-GST 0 HUMAN::P98161
Residue:
4303
  
Inhibitor
Name:
BDBM86432
Synonyms:
(-)-Octylindolactam V NSC_159320
Type:
Small organic molecule
Emp. Form.:
C25H39N3O2
Mol. Mass.:
413.5961
SMILES:
CCCCCCCCc1ccc2N(C)C(C(C)C)C(=O)NC(CO)Cc3c[nH]c1c23
: