Target
Glutamate receptor ionotropic, kainate 2
Ligand
BDBM86476
Substrate
Ki
>10000±n/a nM
Comments
PDSP_3543
Citation
 Christensen, JKVarming, TAhring, PKJørgensen, TDNielsen, EA In vitro characterization of 5-carboxyl-2,4-di-benzamidobenzoic acid (NS3763), a noncompetitive antagonist of GLUK5 receptors. J Pharmacol Exp Ther 309:1003-10 (2004)  
Target
Name:
Glutamate receptor ionotropic, kainate 2
Synonyms:
EAA4 GLUR6 GRIK2_HUMAN GluR-6 Glutamate receptor 6 Glutamate receptor, ionotropic kainate 2 Glutamate-Kainate, GluR6
Type:
Enzyme Catalytic Domain
Mol. Mass.:
102592.78
Organism:
Homo sapiens (Human)
Description:
Q13002
Residue:
908
  
Inhibitor
Name:
BDBM86476
Synonyms:
NS1209 | SPD 502
Type:
Small organic molecule
Emp. Form.:
C24H28N4O7S
Mol. Mass.:
516.567
SMILES:
CN(C)S(=O)(=O)c1ccc(cc1)-c1cc2=C(NOC(CCO)C(O)=O)C(=O)N=c2c2CN(C)CCc12
: