Target
Nicotinic acetylcholine receptor
Ligand
BDBM50171347
Substrate
Ki
0.25±n/a nM
Comments
PDSP_218
Citation
 Xiao, YKellar, KJ The comparative pharmacology and up-regulation of rat neuronal nicotinic receptor subtype binding sites stably expressed in transfected mammalian cells. J Pharmacol Exp Ther 310:98-107 (2004)  
Target
Name:
Nicotinic acetylcholine receptor
Synonyms:
Nicotinic acetylcholine receptor | n-AChR
Type:
Enzyme Catalytic Domain
Mol. Mass.:
2478.99
Organism:
RAT
Description:
n-AChR 0 RAT::Q62594
Residue:
23
  
Inhibitor
Name:
BDBM50171347
Synonyms:
3-(Azetidin-2-ylmethoxy)-pyridine CHEMBL190589
Type:
Small organic molecule
Emp. Form.:
C9H12N2O
Mol. Mass.:
164.2044
SMILES:
C(Oc1cccnc1)C1CCN1
: