Target
P2X purinoceptor 3
Ligand
BDBM31995
Substrate
Ki
452±n/a nM
Comments
PDSP_2668
Citation
 Jarvis, MFBianchi, BUchic, JTCartmell, JLee, CHWilliams, MFaltynek, C [3H]A-317491, a novel high-affinity non-nucleotide antagonist that specifically labels human P2X2/3 and P2X3 receptors. J Pharmacol Exp Ther 310:407-16 (2004)  
Target
Name:
P2X purinoceptor 3
Synonyms:
ATP receptor P2RX3 P2X purinoceptor 3 P2X purinoceptor 3 (P2X3) P2X3 purinoceptor p2x3 + hsa
Type:
Protein
Mol. Mass.:
44292.02
Organism:
Homo sapiens (Human)
Description:
P56373
Residue:
397
  
Inhibitor
Name:
BDBM31995
Synonyms:
ADP CHEMBL14830
Type:
Nucleoside or nucleotide
Emp. Form.:
C10H15N5O10P2
Mol. Mass.:
427.2011
SMILES:
Nc1ncnc2n(cnc12)[C@@H]1O[C@H](COP(O)(=O)OP(O)(O)=O)[C@@H](O)[C@H]1O
: